{"text_format":"1","workbook":"xlsx","n_sheets":3,"sheets":["出場校データ入力・貼付","採点表（作成画面）","採点表(印刷画面)"],"not_rendered":{"charts":0,"images":7,"macros":1,"external_links":0,"defined_names":2,"comments":0,"pivot_tables":0},"unopened":[],"bounds":{"document_bytes":16777216,"sheet_cells":100000,"rows_first":2000,"rows_last":500,"rows_between":2000,"halvings":0,"cell_chars":16384,"cell_head_chars":4096},"cells_cut":0,"cells_raw":0,"read":"whole","date_system":"1900"}

{"sheet":"出場校データ入力・貼付","index":0,"n_rows":3,"n_cols":4,"rows_kept":3,"cut":false,"hidden":false,"merged":[[1,1,1,3],[47,6,47,7]]}
[]
[null,"出場校一覧"]
[null,"NO.","学校名","NO."]

{"sheet":"採点表（作成画面）","index":1,"n_rows":76,"n_cols":19,"rows_kept":76,"cut":false,"hidden":false,"merged":[[0,2,0,4],[3,2,3,3],[4,2,4,3],[2,2,2,3],[0,11,1048575,12],[5,2,5,3],[6,2,6,3],[7,2,7,3],[8,2,8,3],[9,2,9,3],[15,2,15,3],[16,2,16,3],[17,2,17,3],[18,2,18,3],[10,2,10,3],[11,2,11,3],[12,2,12,3],[1,9,2,9],[13,2,13,3],[14,2,14,3]]}
[null,null,"←【男女選択】"]
[null,null,null,null,null,null,null,null,null,"審判\nNO.\n(入力)"]
[null,"コート番号\n(入力)","対戦時点\n(選択)",null,"NO.\n(入力)",null,null,"NO.\n(入力)",null,null,null,null,null,null,null,null,null,"NO.","学 　校 　名"]
[1,null,null,null,null,{"$f":"IF('採点表(印刷画面)'!I6=\"\",\"\",'採点表(印刷画面)'!I6)","v":""},"－",null,{"$f":"IF('採点表(印刷画面)'!AE6=\"\",\"\",'採点表(印刷画面)'!AE6)","v":""},null,{"$f":"IFERROR(VLOOKUP(J4,$R$4:$S$59,2,FALSE),\"\")","v":""},null,null,null,null,null,null,{"$f":"IF(出場校データ入力・貼付!B4&出場校データ入力・貼付!D4=\"\",\"\",IF(出場校データ入力・貼付!B4<>\"\",出場校データ入力・貼付!B4,出場校データ入力・貼付!D4))","v":""},{"$f":"IF(出場校データ入力・貼付!C4=\"\",\"\",出場校データ入力・貼付!C4)","v":""}]
[2,null,null,null,null,{"$f":"IF('採点表(印刷画面)'!I85=\"\",\"\",'採点表(印刷画面)'!I85)","v":""},"－",null,{"$f":"IF('採点表(印刷画面)'!AE85=\"\",\"\",'採点表(印刷画面)'!AE85)","v":""},null,{"$f":"IFERROR(VLOOKUP(J5,$R$4:$S$59,2,FALSE),\"\")","v":""},null,null,null,null,null,null,{"$f":"IF(出場校データ入力・貼付!B5&出場校データ入力・貼付!D5=\"\",\"\",IF(出場校データ入力・貼付!B5<>\"\",出場校データ入力・貼付!B5,出場校データ入力・貼付!D5))","v":""},{"$f":"IF(出場校データ入力・貼付!C5=\"\",\"\",出場校データ入力・貼付!C5)","v":""}]
[3,null,null,null,null,{"$f":"IF('採点表(印刷画面)'!I164=\"\",\"\",'採点表(印刷画面)'!I164)","v":""},"－",null,{"$f":"IF('採点表(印刷画面)'!AE164=\"\",\"\",'採点表(印刷画面)'!AE164)","v":""},null,"",null,null,null,null,null,null,{"$f":"IF(出場校データ入力・貼付!B6&出場校データ入力・貼付!D6=\"\",\"\",IF(出場校データ入力・貼付!B6<>\"\",出場校データ入力・貼付!B6,出場校データ入力・貼付!D6))","v":""},{"$f":"IF(出場校データ入力・貼付!C6=\"\",\"\",出場校データ入力・貼付!C6)","v":""}]
[4,null,null,null,null,{"$f":"IF('採点表(印刷画面)'!I243=\"\",\"\",'採点表(印刷画面)'!I243)","v":""},"－",null,{"$f":"IF('採点表(印刷画面)'!AE243=\"\",\"\",'採点表(印刷画面)'!AE243)","v":""},null,"",null,null,null,null,null,null,{"$f":"IF(出場校データ入力・貼付!B7&出場校データ入力・貼付!D7=\"\",\"\",IF(出場校データ入力・貼付!B7<>\"\",出場校データ入力・貼付!B7,出場校データ入力・貼付!D7))","v":""},{"$f":"IF(出場校データ入力・貼付!C7=\"\",\"\",出場校データ入力・貼付!C7)","v":""}]
[5,null,null,null,null,{"$f":"IF('採点表(印刷画面)'!I322=\"\",\"\",'採点表(印刷画面)'!I322)","v":""},"－",null,{"$f":"IF('採点表(印刷画面)'!AE322=\"\",\"\",'採点表(印刷画面)'!AE322)","v":""},null,"",null,null,null,null,null,null,{"$f":"IF(出場校データ入力・貼付!B8&出場校データ入力・貼付!D8=\"\",\"\",IF(出場校データ入力・貼付!B8<>\"\",出場校データ入力・貼付!B8,出場校データ入力・貼付!D8))","v":""},{"$f":"IF(出場校データ入力・貼付!C8=\"\",\"\",出場校データ入力・貼付!C8)","v":""}]
[6,null,null,null,null,{"$f":"IF('採点表(印刷画面)'!I401=\"\",\"\",'採点表(印刷画面)'!I401)","v":""},"－",null,{"$f":"IF('採点表(印刷画面)'!AE401=\"\",\"\",'採点表(印刷画面)'!AE401)","v":""},null,"",null,null,null,null,null,null,{"$f":"IF(出場校データ入力・貼付!B9&出場校データ入力・貼付!D9=\"\",\"\",IF(出場校データ入力・貼付!B9<>\"\",出場校データ入力・貼付!B9,出場校データ入力・貼付!D9))","v":""},{"$f":"IF(出場校データ入力・貼付!C9=\"\",\"\",出場校データ入力・貼付!C9)","v":""}]
[7,null,null,null,null,{"$f":"IF('採点表(印刷画面)'!I480=\"\",\"\",'採点表(印刷画面)'!I480)","v":""},"－",null,{"$f":"IF('採点表(印刷画面)'!AE480=\"\",\"\",'採点表(印刷画面)'!AE480)","v":""},null,"",null,null,null,null,null,null,{"$f":"IF(出場校データ入力・貼付!B10&出場校データ入力・貼付!D10=\"\",\"\",IF(出場校データ入力・貼付!B10<>\"\",出場校データ入力・貼付!B10,出場校データ入力・貼付!D10))","v":""},{"$f":"IF(出場校データ入力・貼付!C10=\"\",\"\",出場校データ入力・貼付!C10)","v":""}]
{"$rows_left_out":67}
{"sheet":"採点表(印刷画面)","index":2,"n_rows":632,"n_cols":76,"rows_kept":632,"cut":false,"hidden":false,"merged":[[631,0,631,37],[631,38,631,75],[630,51,630,53],[630,54,630,59],[630,60,630,62],[630,63,630,67],[630,68,630,70],[630,71,630,75],[630,25,630,29],[630,30,630,32],[630,33,630,37],[630,38,630,42],[630,43,630,45],[630,46,630,50],[630,0,630,4],[630,5,630,7],[630,8,630,12],[630,13,630,15],[630,16,630,21],[630,22,630,24],[625,70,626,72],[625,73,626,75],[628,0,629,2],[628,3,629,17],[628,18,629,19],[628,20,629,37],[628,38,629,40],[628,41,629,55],[628,56,629,57],[628,58,629,75],[625,38,626,40],[625,41,626,43],[625,44,626,46],[625,47,626,49],[625,64,626,66],[625,67,626,69],[624,70,624,72],[624,73,624,75],[625,0,626,2],[625,3,626,5],[625,6,626,8],[625,9,626,11],[625,26,626,28],[625,29,626,31],[625,32,626,34],[625,35,626,37],[624,44,624,46],[624,47,624,49],[624,50,624,56],[624,57,624,63],[624,64,624,66],[624,67,624,69],[624,26,624,28],[624,29,624,31],[624,32,624,34],[624,35,624,37],[624,38,624,40],[624,41,624,43],[624,0,624,2],[624,3,624,5],[624,6,624,8],[624,9,624,11],[624,12,624,18],[624,19,624,25],[620,54,623,55],[620,56,623,57],[620,58,623,59],[620,60,623,61],[620,62,620,68],[620,69,620,75],[620,22,623,23],[620,24,620,30],[620,31,620,37],[620,38,623,39],[620,40,620,46],[620,47,620,53],[618,54,619,55],[618,56,619,57],[618,58,619,59],[618,60,619,61],[620,0,623,1],[620,2,620,8],[620,9,620,15],[620,16,623,17],[620,18,623,19],[620,20,623,21],[616,54,617,55],[616,56,617,57],[616,58,617,59],[616,60,617,61],[618,0,619,1],[618,16,619,17],[618,18,619,19],[618,20,619,21],[618,22,619,23],[618,38,619,39],[614,54,615,55],[614,56,615,57],[614,58,615,59],[614,60,615,61],[616,0,617,1],[616,16,617,17],[616,18,617,19],[616,20,617,21],[616,22,617,23],[616,38,617,39],[612,54,613,55],[612,56,613,57],[612,58,613,59],[612,60,613,61],[614,0,615,1],[614,16,615,17],[614,18,615,19],[614,20,615,21],[614,22,615,23],[614,38,615,39],[610,54,611,55],[610,56,611,57],[610,58,611,59],[610,60,611,61],[612,0,613,1],[612,16,613,17],[612,18,613,19],[612,20,613,21],[612,22,613,23],[612,38,613,39],[608,54,609,55],[608,56,609,57],[608,58,609,59],[608,60,609,61],[610,0,611,1],[610,16,611,17],[610,18,611,19],[610,20,611,21],[610,22,611,23],[610,38,611,39],[608,0,609,1],[608,16,609,17],[608,18,609,19],[608,20,609,21],[608,22,609,23],[608,38,609,39],[606,70,607,70],[606,0,607,3],[606,22,607,25],[606,38,607,41],[606,60,607,63],[606,71,607,75],[607,16,607,21],[607,54,607,59],[606,48,607,48],[606,49,607,53],[606,54,606,59],[606,64,607,64],[606,65,607,69],[606,27,607,31],[606,32,607,32],[606,33,607,37],[606,42,607,42],[606,43,607,47],[603,70,604,72],[603,73,604,75],[606,4,607,4],[606,5,607,9],[606,10,607,10],[606,11,607,15],[606,16,606,21],[606,26,607,26],[603,38,604,40],[603,41,604,43],[603,44,604,46],[603,47,604,49],[603,64,604,66],[603,67,604,69],[602,70,602,72],[602,73,602,75],[603,0,604,2],[603,3,604,5],[603,6,604,8],[603,9,604,11],[603,26,604,28],[603,29,604,31],[603,32,604,34],[603,35,604,37],[602,44,602,46],[602,47,602,49],[602,50,602,56],[602,57,602,63],[602,64,602,66],[602,67,602,69],[602,26,602,28],[602,29,602,31],[602,32,602,34],[602,35,602,37],[602,38,602,40],[602,41,602,43],[602,0,602,2],[602,3,602,5],[602,6,602,8],[602,9,602,11],[602,12,602,18],[602,19,602,25],[598,54,601,55],[598,56,601,57],[598,58,601,59],[598,60,601,61],[598,62,598,68],[598,69,598,75],[598,22,601,23],[598,24,598,30],[598,31,598,37],[598,38,601,39],[598,40,598,46],[598,47,598,53],[596,54,597,55],[596,56,597,57],[596,58,597,59],[596,60,597,61],[598,0,601,1],[598,2,598,8],[598,9,598,15],[598,16,601,17],[598,18,601,19],[598,20,601,21],[594,54,595,55],[594,56,595,57],[594,58,595,59],[594,60,595,61],[596,0,597,1],[596,16,597,17],[596,18,597,19],[596,20,597,21],[596,22,597,23],[596,38,597,39],[592,54,593,55],[592,56,593,57],[592,58,593,59],[592,60,593,61],[594,0,595,1],[594,16,595,17],[594,18,595,19],[594,20,595,21],[594,22,595,23],[594,38,595,39],[590,54,591,55],[590,56,591,57],[590,58,591,59],[590,60,591,61],[592,0,593,1],[592,16,593,17],[592,18,593,19],[592,20,593,21],[592,22,593,23],[592,38,593,39],[588,54,589,55],[588,56,589,57],[588,58,589,59],[588,60,589,61],[590,0,591,1],[590,16,591,17],[590,18,591,19],[590,20,591,21],[590,22,591,23],[590,38,591,39],[586,54,587,55],[586,56,587,57],[586,58,587,59],[586,60,587,61],[588,0,589,1],[588,16,589,17],[588,18,589,19],[588,20,589,21],[588,22,589,23],[588,38,589,39],[586,0,587,1],[586,16,587,17],[586,18,587,19],[586,20,587,21],[586,22,587,23],[586,38,587,39],[584,70,585,70],[584,60,585,63],[584,38,585,41],[584,22,585,25],[584,0,585,3],[584,71,585,75],[585,16,585,21],[585,54,585,59],[584,48,585,48],[584,49,585,53],[584,54,584,59],[584,64,585,64],[584,65,585,69],[584,27,585,31],[584,32,585,32],[584,33,585,37],[584,42,585,42],[584,43,585,47],[581,70,582,72],[581,73,582,75],[584,4,585,4],[584,5,585,9],[584,10,585,10],[584,11,585,15],[584,16,584,21],[584,26,585,26],[581,38,582,40],[581,41,582,43],[581,44,582,46],[581,47,582,49],[581,64,582,66],[581,67,582,69],[580,70,580,72],[580,73,580,75],[581,0,582,2],[581,3,582,5],[581,6,582,8],[581,9,582,11],[581,26,582,28],[581,29,582,31],[581,32,582,34],[581,35,582,37],[580,44,580,46],[580,47,580,49],[580,50,580,56],[580,57,580,63],[580,64,580,66],[580,67,580,69],[580,26,580,28],[580,29,580,31],[580,32,580,34],[580,35,580,37],[580,38,580,40],[580,41,580,43],[580,0,580,2],[580,3,580,5],[580,6,580,8],[580,9,580,11],[580,12,580,18],[580,19,580,25],[576,54,579,55],[576,56,579,57],[576,58,579,59],[576,60,579,61],[576,62,576,68],[576,69,576,75],[576,22,579,23],[576,24,576,30],[576,31,576,37],[576,38,579,39],[576,40,576,46],[576,47,576,53],[574,54,575,55],[574,56,575,57],[574,58,575,59],[574,60,575,61],[576,0,579,1],[576,2,576,8],[576,9,576,15],[576,16,579,17],[576,18,579,19],[576,20,579,21],[572,54,573,55],[572,56,573,57],[572,58,573,59],[572,60,573,61],[574,0,575,1],[574,16,575,17],[574,18,575,19],[574,20,575,21],[574,22,575,23],[574,38,575,39],[570,54,571,55],[570,56,571,57],[570,58,571,59],[570,60,571,61],[572,0,573,1],[572,16,573,17],[572,18,573,19],[572,20,573,21],[572,22,573,23],[572,38,573,39],[562,64,563,64],[568,54,569,55],[568,56,569,57],[568,58,569,59],[568,60,569,61],[570,0,571,1],[570,16,571,17],[570,18,571,19],[570,20,571,21],[570,22,571,23],[570,38,571,39],[566,54,567,55],[566,56,567,57],[566,58,567,59],[566,60,567,61],[568,0,569,1],[568,16,569,17],[568,18,569,19],[568,20,569,21],[568,22,569,23],[568,38,569,39],[562,0,563,3],[562,22,563,25],[562,38,563,41],[562,60,563,63],[562,5,563,9],[562,10,563,10],[562,11,563,15],[562,16,562,21],[564,54,565,55],[564,56,565,57],[564,58,565,59],[564,60,565,61],[566,0,567,1],[566,16,567,17],[566,18,567,19],[566,20,567,21],[566,22,567,23],[566,38,567,39],[564,0,565,1],[564,16,565,17],[564,18,565,19],[564,20,565,21],[564,22,565,23],[564,38,565,39],[558,0,561,1],[558,2,561,4],[558,5,561,7],[558,8,561,15],[558,16,558,21],[558,22,561,23],[559,16,559,21],[560,16,560,21],[561,16,561,21],[558,54,558,59],[558,60,561,61],[562,65,563,69],[562,70,563,70],[562,71,563,75],[563,16,563,21],[563,54,563,59],[562,42,563,42],[562,43,563,47],[562,48,563,48],[562,49,563,53],[562,54,562,59],[562,26,563,26],[562,27,563,31],[562,32,563,32],[562,33,563,37],[562,4,563,4],[556,54,557,58],[556,59,557,65],[556,66,557,70],[556,71,557,75],[556,38,557,38],[556,39,557,42],[556,47,557,47],[556,48,557,49],[556,12,557,13],[556,14,557,15],[556,16,557,20],[556,21,557,27],[556,28,557,32],[556,33,557,37],[558,46,561,53],[558,62,561,64],[558,65,561,67],[558,68,561,75],[559,54,559,59],[560,54,560,59],[561,54,561,59],[558,24,561,26],[558,27,561,29],[558,30,561,37],[558,38,561,39],[558,40,561,42],[558,43,561,45],[556,0,557,0],[556,1,557,4],[556,9,557,9],[556,10,557,11],[556,50,557,51],[556,52,557,53],[556,5,557,8],[556,43,557,46],[552,0,552,37],[552,38,552,75],[554,0,554,5],[554,10,554,27],[554,38,554,43],[554,48,554,65],[551,51,551,53],[551,54,551,59],[551,60,551,62],[551,63,551,67],[551,68,551,70],[551,71,551,75],[551,25,551,29],[551,30,551,32],[551,33,551,37],[551,38,551,42],[551,43,551,45],[551,46,551,50],[551,0,551,4],[551,5,551,7],[551,8,551,12],[551,13,551,15],[551,16,551,21],[551,22,551,24],[546,70,547,72],[546,73,547,75],[549,0,550,2],[549,3,550,17],[549,18,550,19],[549,20,550,37],[549,38,550,40],[549,41,550,55],[549,56,550,57],[549,58,550,75],[546,38,547,40],[546,41,547,43],[546,44,547,46],[546,47,547,49],[546,64,547,66],[546,67,547,69],[545,70,545,72],[545,73,545,75],[546,0,547,2],[546,3,547,5],[546,6,547,8],[546,9,547,11],[546,26,547,28],[546,29,547,31],[546,32,547,34],[546,35,547,37],[545,44,545,46],[545,47,545,49],[545,50,545,56],[545,57,545,63],[545,64,545,66],[545,67,545,69],[545,26,545,28],[545,29,545,31],[545,32,545,34],[545,35,545,37],[545,38,545,40],[545,41,545,43],[545,0,545,2],[545,3,545,5],[545,6,545,8],[545,9,545,11],[545,12,545,18],[545,19,545,25],[541,54,544,55],[541,56,544,57],[541,58,544,59],[541,60,544,61],[541,62,541,68],[541,69,541,75],[541,22,544,23],[541,24,541,30],[541,31,541,37],[541,38,544,39],[541,40,541,46],[541,47,541,53],[539,54,540,55],[539,56,540,57],[539,58,540,59],[539,60,540,61],[541,0,544,1],[541,2,541,8],[541,9,541,15],[541,16,544,17],[541,18,544,19],[541,20,544,21],[537,54,538,55],[537,56,538,57],[537,58,538,59],[537,60,538,61],[539,0,540,1],[539,16,540,17],[539,18,540,19],[539,20,540,21],[539,22,540,23],[539,38,540,39],[535,54,536,55],[535,56,536,57],[535,58,536,59],[535,60,536,61],[537,0,538,1],[537,16,538,17],[537,18,538,19],[537,20,538,21],[537,22,538,23],[537,38,538,39],[533,54,534,55],[533,56,534,57],[533,58,534,59],[533,60,534,61],[535,0,536,1],[535,16,536,17],[535,18,536,19],[535,20,536,21],[535,22,536,23],[535,38,536,39],[531,54,532,55],[531,56,532,57],[531,58,532,59],[531,60,532,61],[533,0,534,1],[533,16,534,17],[533,18,534,19],[533,20,534,21],[533,22,534,23],[533,38,534,39],[529,54,530,55],[529,56,530,57],[529,58,530,59],[529,60,530,61],[531,0,532,1],[531,16,532,17],[531,18,532,19],[531,20,532,21],[531,22,532,23],[531,38,532,39],[529,0,530,1],[529,16,530,17],[529,18,530,19],[529,20,530,21],[529,22,530,23],[529,38,530,39],[527,70,528,70],[527,0,528,3],[527,22,528,25],[527,38,528,41],[527,60,528,63],[527,71,528,75],[528,16,528,21],[528,54,528,59],[527,48,528,48],[527,49,528,53],[527,54,527,59],[527,64,528,64],[527,65,528,69],[527,27,528,31],[527,32,528,32],[527,33,528,37],[527,42,528,42],[527,43,528,47],[524,70,525,72],[524,73,525,75],[527,4,528,4],[527,5,528,9],[527,10,528,10],[527,11,528,15],[527,16,527,21],[527,26,528,26],[524,38,525,40],[524,41,525,43],[524,44,525,46],[524,47,525,49],[524,64,525,66],[524,67,525,69],[523,70,523,72],[523,73,523,75],[524,0,525,2],[524,3,525,5],[524,6,525,8],[524,9,525,11],[524,26,525,28],[524,29,525,31],[524,32,525,34],[524,35,525,37],[523,44,523,46],[523,47,523,49],[523,50,523,56],[523,57,523,63],[523,64,523,66],[523,67,523,69],[523,26,523,28],[523,29,523,31],[523,32,523,34],[523,35,523,37],[523,38,523,40],[523,41,523,43],[523,0,523,2],[523,3,523,5],[523,6,523,8],[523,9,523,11],[523,12,523,18],[523,19,523,25],[519,54,522,55],[519,56,522,57],[519,58,522,59],[519,60,522,61],[519,62,519,68],[519,69,519,75],[519,22,522,23],[519,24,519,30],[519,31,519,37],[519,38,522,39],[519,40,519,46],[519,47,519,53],[517,54,518,55],[517,56,518,57],[517,58,518,59],[517,60,518,61],[519,0,522,1],[519,2,519,8],[519,9,519,15],[519,16,522,17],[519,18,522,19],[519,20,522,21],[515,54,516,55],[515,56,516,57],[515,58,516,59],[515,60,516,61],[517,0,518,1],[517,16,518,17],[517,18,518,19],[517,20,518,21],[517,22,518,23],[517,38,518,39],[513,54,514,55],[513,56,514,57],[513,58,514,59],[513,60,514,61],[515,0,516,1],[515,16,516,17],[515,18,516,19],[515,20,516,21],[515,22,516,23],[515,38,516,39],[511,54,512,55],[511,56,512,57],[511,58,512,59],[511,60,512,61],[513,0,514,1],[513,16,514,17],[513,18,514,19],[513,20,514,21],[513,22,514,23],[513,38,514,39],[509,54,510,55],[509,56,510,57],[509,58,510,59],[509,60,510,61],[511,0,512,1],[511,16,512,17],[511,18,512,19],[511,20,512,21],[511,22,512,23],[511,38,512,39],[507,54,508,55],[507,56,508,57],[507,58,508,59],[507,60,508,61],[509,0,510,1],[509,16,510,17],[509,18,510,19],[509,20,510,21],[509,22,510,23],[509,38,510,39],[507,0,508,1],[507,16,508,17],[507,18,508,19],[507,20,508,21],[507,22,508,23],[507,38,508,39],[505,70,506,70],[505,0,506,3],[505,22,506,25],[505,38,506,41],[505,60,506,63],[505,71,506,75],[506,16,506,21],[506,54,506,59],[505,48,506,48],[505,49,506,53],[505,54,505,59],[505,64,506,64],[505,65,506,69],[505,27,506,31],[505,32,506,32],[505,33,506,37],[505,42,506,42],[505,43,506,47],[502,70,503,72],[502,73,503,75],[505,4,506,4],[505,5,506,9],[505,10,506,10],[505,11,506,15],[505,16,505,21],[505,26,506,26],[502,38,503,40],[502,41,503,43],[502,44,503,46],[502,47,503,49],[502,64,503,66],[502,67,503,69],[501,70,501,72],[501,73,501,75],[502,0,503,2],[502,3,503,5],[502,6,503,8],[502,9,503,11],[502,26,503,28],[502,29,503,31],[502,32,503,34],[502,35,503,37],[501,44,501,46],[501,47,501,49],[501,50,501,56],[501,57,501,63],[501,64,501,66],[501,67,501,69],[501,26,501,28],[501,29,501,31],[501,32,501,34],[501,35,501,37],[501,38,501,40],[501,41,501,43],[501,0,501,2],[501,3,501,5],[501,6,501,8],[501,9,501,11],[501,12,501,18],[501,19,501,25],[497,54,500,55],[497,56,500,57],[497,58,500,59],[497,60,500,61],[497,62,497,68],[497,69,497,75],[497,22,500,23],[497,24,497,30],[497,31,497,37],[497,38,500,39],[497,40,497,46],[497,47,497,53],[495,54,496,55],[495,56,496,57],[495,58,496,59],[495,60,496,61],[497,0,500,1],[497,2,497,8],[497,9,497,15],[497,16,500,17],[497,18,500,19],[497,20,500,21],[493,54,494,55],[493,56,494,57],[493,58,494,59],[493,60,494,61],[495,0,496,1],[495,16,496,17],[495,18,496,19],[495,20,496,21],[495,22,496,23],[495,38,496,39],[491,54,492,55],[491,56,492,57],[491,58,492,59],[491,60,492,61],[493,0,494,1],[493,16,494,17],[493,18,494,19],[493,20,494,21],[493,22,494,23],[493,38,494,39],[483,64,484,64],[489,54,490,55],[489,56,490,57],[489,58,490,59],[489,60,490,61],[491,0,492,1],[491,16,492,17],[491,18,492,19],[491,20,492,21],[491,22,492,23],[491,38,492,39],[487,54,488,55],[487,56,488,57],[487,58,488,59],[487,60,488,61],[489,0,490,1],[489,16,490,17],[489,18,490,19],[489,20,490,21],[489,22,490,23],[489,38,490,39],[483,0,484,3],[483,22,484,25],[483,38,484,41],[483,60,484,63],[483,5,484,9],[483,10,484,10],[483,11,484,15],[483,16,483,21],[485,54,486,55],[485,56,486,57],[485,58,486,59],[485,60,486,61],[487,0,488,1],[487,16,488,17],[487,18,488,19],[487,20,488,21],[487,22,488,23],[487,38,488,39],[485,0,486,1],[485,16,486,17],[485,18,486,19],[485,20,486,21],[485,22,486,23],[485,38,486,39],[479,0,482,1],[479,2,482,4],[479,5,482,7],[479,8,482,15],[479,16,479,21],[479,22,482,23],[480,16,480,21],[481,16,481,21],[482,16,482,21],[479,54,479,59],[479,60,482,61],[483,65,484,69],[483,70,484,70],[483,71,484,75],[484,16,484,21],[484,54,484,59],[483,42,484,42],[483,43,484,47],[483,48,484,48],[483,49,484,53],[483,54,483,59],[483,26,484,26],[483,27,484,31],[483,32,484,32],[483,33,484,37],[483,4,484,4],[477,54,478,58],[477,59,478,65],[477,66,478,70],[477,71,478,75],[477,38,478,38],[477,39,478,42],[477,47,478,47],[477,48,478,49],[477,12,478,13],[477,14,478,15],[477,16,478,20],[477,21,478,27],[477,28,478,32],[477,33,478,37],[479,46,482,53],[479,62,482,64],[479,65,482,67],[479,68,482,75],[480,54,480,59],[481,54,481,59],[482,54,482,59],[479,24,482,26],[479,27,482,29],[479,30,482,37],[479,38,482,39],[479,40,482,42],[479,43,482,45],[477,0,478,0],[477,1,478,4],[477,9,478,9],[477,10,478,11],[477,50,478,51],[477,52,478,53],[477,5,478,8],[477,43,478,46],[473,0,473,37],[473,38,473,75],[475,0,475,5],[475,10,475,27],[475,38,475,43],[475,48,475,65],[472,51,472,53],[472,54,472,59],[472,60,472,62],[472,63,472,67],[472,68,472,70],[472,71,472,75],[472,25,472,29],[472,30,472,32],[472,33,472,37],[472,38,472,42],[472,43,472,45],[472,46,472,50],[472,0,472,4],[472,5,472,7]],"merged_total":3936,"flags":["merged_cut"]}
[1,null,null,null,null,null,null,null,null,null,null,null,null,null,null,null,null,null,null,null,null,null,null,null,null,null,null,null,null,null,null,null,null,null,null,null,null,null,9]
["NO",null,null,null,null,null,null,null,null,null,"団　　体　　戦　　採　　点　　表",null,null,null,null,null,null,null,null,null,null,null,null,null,null,null,null,null,null,null,null,null,null,null,null,null,null,null,"NO",null,null,null,null,null,null,null,null,null,"団　　体　　戦　　採　　点　　表"]
[]
["種別",{"$f":"IF('採点表（作成画面）'!B1=\"\",\"\",'採点表（作成画面）'!B1)","v":""},null,null,null,{"$f":"IF('採点表（作成画面）'!C4=\"\",\"第　　　回戦\",'採点表（作成画面）'!C4)","v":"第　　　回戦"},null,null,null,"第",{"$f":"IF('採点表（作成画面）'!B4=\"\",\"\",'採点表（作成画面）'!B4)","v":""},null,"コート",null,"正審",null,{"$f":"'採点表（作成画面）'!J4&\"   \"&IF('採点表（作成画面）'!J4=\"\",\"\",(VLOOKUP('採点表（作成画面）'!J4,'採点表（作成画面）'!$R$4:$S$110,2,FALSE)))","v":"   "},null,null,null,null,"副審",null,null,null,null,null,null,"線審",null,null,null,null,"線審",null,null,null,null,"種別",{"$f":"B4","v":""},null,null,null,{"$f":"IF('採点表（作成画面）'!C12=\"\",\"第　　　回戦\",'採点表（作成画面）'!C12)","v":"第　　　回戦"},null,null,null,"第",{"$f":"IF('採点表（作成画面）'!B12=\"\",\"\",'採点表（作成画面）'!B12)","v":""},null,"コート",null,"正審",null,{"$f":"'採点表（作成画面）'!J12&\"   \"&IF('採点表（作成画面）'!J12=\"\",\"\",(VLOOKUP('採点表（作成画面）'!J12,'採点表（作成画面）'!$R$4:$S$110,2,FALSE)))","v":"   "},null,null,null,null,"副審",null,null,null,null,null,null,"線審",null,null,null,null,"線審"]
[]
["ＮＯ",null,{"$f":"IF('採点表（作成画面）'!E4=\"\",\"\",'採点表（作成画面）'!E4)","v":""},null,null,"チーム名",null,null,{"$f":"IFERROR(VLOOKUP(C6,'採点表（作成画面）'!$R$4:$S$110,2,FALSE),\"\")","v":""},null,null,null,null,null,null,null,"開始　　　　時　　　分",null,null,null,null,null,"ＮＯ",null,{"$f":"IF('採点表（作成画面）'!H4=\"\",\"\",'採点表（作成画面）'!H4)","v":""},null,null,"チーム名",null,null,{"$f":"IFERROR(VLOOKUP(Y6,'採点表（作成画面）'!$R$4:$S$110,2,FALSE),\"\")","v":""},null,null,null,null,null,null,null,"ＮＯ",null,{"$f":"IF('採点表（作成画面）'!E12=\"\",\"\",'採点表（作成画面）'!E12)","v":""},null,null,"チーム名",null,null,{"$f":"IFERROR(VLOOKUP(AO6,'採点表（作成画面）'!$R$4:$S$110,2,FALSE),\"\")","v":""},null,null,null,null,null,null,null,"開始　　　　時　　　分",null,null,null,null,null,"ＮＯ",null,{"$f":"IF('採点表（作成画面）'!H12=\"\",\"\",'採点表（作成画面）'!H12)","v":""},null,null,"チーム名",null,null,{"$f":"IFERROR(VLOOKUP(BK6,'採点表（作成画面）'!$R$4:$S$110,2,FALSE),\"\")","v":""}]
[null,null,null,null,null,null,null,null,null,null,null,null,null,null,null,null,"終了　　　　時　　　分",null,null,null,null,null,null,null,null,null,null,null,null,null,null,null,null,null,null,null,null,null,null,null,null,null,null,null,null,null,null,null,null,null,null,null,null,null,"終了　　　　時　　　分"]
[null,null,null,null,null,null,null,null,null,null,null,null,null,null,null,null,"使用球",null,null,null,null,null,null,null,null,null,null,null,null,null,null,null,null,null,null,null,null,null,null,null,null,null,null,null,null,null,null,null,null,null,null,null,null,null,"使用球"]
[null,null,null,null,null,null,null,null,null,null,null,null,null,null,null,null,"Ｍ　・　Ｋ",null,null,null,null,null,null,null,null,null,null,null,null,null,null,null,null,null,null,null,null,null,null,null,null,null,null,null,null,null,null,null,null,null,null,null,null,null,"Ｍ　・　Ｋ"]
["サイド",null,null,null,"Ａ",null,null,null,null,null,"Ｂ",null,null,null,null,null,"第１対戦スコアー",null,null,null,null,null,"サイド",null,null,null,"Ａ",null,null,null,null,null,"Ｂ",null,null,null,null,null,"サイド",null,null,null,"Ａ",null,null,null,null,null,"Ｂ",null,null,null,null,null,"第１対戦スコアー",null,null,null,null,null,"サイド",null,null,null,"Ａ",null,null,null,null,null,"Ｂ"]
{"$rows_left_out":622}